Reaction Details
TargetFructose-1,6-bisphosphatase 1
LigandBDBM50117947
Substrate/Competitorn/a
Meas. Tech.ChEMBL_69125 (CHEMBL681467)
IC50 790±n/a nM
Citation Wright, SWCarlo, AACarty, MDDanley, DEHageman, DLKaram, GALevy, CBMansour, MNMathiowetz, AMMcClure, LDNestor, NBMcPherson, RKPandit, JPustilnik, LRSchulte, GKSoeller, WCTreadway, JLWang, IKBauer, PH Anilinoquinazoline inhibitors of fructose 1,6-bisphosphatase bind at a novel allosteric site: synthesis, in vitro characterization, and X-ray crystallography. J Med Chem45:3865-77 (2002) Fructose-1,6-bisphosphatase 1
Name:Fructose-1,6-bisphosphatase 1
Type:PROTEIN
Mol. Mass.:39605.40
Organism:Rattus norvegicus
Description:ChEMBL_595158
Residue:363
BDBM50117947
NameBDBM50117947
Synonyms:(6,7-Diethoxy-quinazolin-4-yl)-[3-(2-methyl-thiazol-4-yl)-phenyl]-amine | CHEMBL126456
TypeSmall organic molecule
Emp. Form.C22H22N4O2S
Mol. Mass.406.501
SMILESCCOc1cc2ncnc(Nc3cccc(c3)-c3csc(C)n3)c2cc1OCC