Reaction Details
TargetEpidermal growth factor receptor
LigandBDBM50117986
Substrate/Competitorn/a
Meas. Tech.ChEMBL_67206 (CHEMBL678292)
IC50 11±n/a nM
Citation Wright, SWCarlo, AACarty, MDDanley, DEHageman, DLKaram, GALevy, CBMansour, MNMathiowetz, AMMcClure, LDNestor, NBMcPherson, RKPandit, JPustilnik, LRSchulte, GKSoeller, WCTreadway, JLWang, IKBauer, PH Anilinoquinazoline inhibitors of fructose 1,6-bisphosphatase bind at a novel allosteric site: synthesis, in vitro characterization, and X-ray crystallography. J Med Chem45:3865-77 (2002) Epidermal growth factor receptor
Name:Epidermal growth factor receptor
Type:Receptor Kinase Domain
Mol. Mass.:134279.59
Organism:Homo sapiens (Human)
Description:P00533
Residue:1210
BDBM50117986
NameBDBM50117986
Synonyms:(6,7-Diethoxy-quinazolin-4-yl)-[3-(1H-pyrazol-3-yl)-phenyl]-amine | CHEMBL125920
TypeSmall organic molecule
Emp. Form.C21H21N5O2
Mol. Mass.375.4237
SMILESCCOc1cc2ncnc(Nc3cccc(c3)-c3cc[nH]n3)c2cc1OCC