Reaction Details
TargetCholesteryl ester transfer protein
LigandBDBM50118037
Substrate/Competitorn/a
Meas. Tech.ChEMBL_48930 (CHEMBL665925)
IC50 300±n/a nM
Citation Durley, RCGrapperhaus, MLHickory, BSMassa, MAWang, JLSpangler, DPMischke, DAParnas, BLFobian, YMRath, NPHonda, DDZeng, MConnolly, DTHeuvelman, DMWitherbee, BJMelton, MAGlenn, KCKrul, ESSmith, MESikorski, JA Chiral N,N-disubstituted trifluoro-3-amino-2-propanols are potent inhibitors of cholesteryl ester transfer protein. J Med Chem45:3891-904 (2002) Cholesteryl ester transfer protein
Name:Cholesteryl ester transfer protein
Type:Enzyme
Mol. Mass.:54751.53
Organism:Homo sapiens (Human)
Description:P11597
Residue:493
BDBM50118037
NameBDBM50118037
Synonyms:3-((3-cyclopentylbenzyl)(3-phenoxyphenyl)amino)-1,1,1-trifluoropropan-2-ol CHEMBL125629
TypeSmall organic molecule
Emp. Form.C27H28F3NO2
Mol. Mass.455.5119
SMILESOC(CN(Cc1cccc(c1)C1CCCC1)c1cccc(Oc2ccccc2)c1)C(F)(F)F