Reaction Details
TargetCholesteryl ester transfer protein
LigandBDBM50118045
Substrate/Competitorn/a
Meas. Tech.ChEMBL_48930 (CHEMBL665925)
IC50 350±n/a nM
Citation Durley, RCGrapperhaus, MLHickory, BSMassa, MAWang, JLSpangler, DPMischke, DAParnas, BLFobian, YMRath, NPHonda, DDZeng, MConnolly, DTHeuvelman, DMWitherbee, BJMelton, MAGlenn, KCKrul, ESSmith, MESikorski, JA Chiral N,N-disubstituted trifluoro-3-amino-2-propanols are potent inhibitors of cholesteryl ester transfer protein. J Med Chem45:3891-904 (2002) Cholesteryl ester transfer protein
Name:Cholesteryl ester transfer protein
Type:Enzyme
Mol. Mass.:54751.53
Organism:Homo sapiens (Human)
Description:P11597
Residue:493
BDBM50118045
NameBDBM50118045
Synonyms:1,1,1-Trifluoro-3-[(3-isopropoxy-benzyl)-(3-phenoxy-phenyl)-amino]-propan-2-ol CHEMBL339447
TypeSmall organic molecule
Emp. Form.C25H26F3NO3
Mol. Mass.445.474
SMILESCC(C)Oc1cccc(CN(CC(O)C(F)(F)F)c2cccc(Oc3ccccc3)c2)c1