Reaction Details
TargetTyrosine-protein phosphatase non-receptor type 1
LigandBDBM50118093
Substrate/Competitorn/a
Meas. Tech.ChEMBL_154454 (CHEMBL756367)
IC50 250000±n/a nM
Citation Chen, YTSeto, CT Divalent and trivalent alpha-ketocarboxylic acids as inhibitors of protein tyrosine phosphatases. J Med Chem45:3946-52 (2002) Tyrosine-protein phosphatase non-receptor type 1
Name:Tyrosine-protein phosphatase non-receptor type 1
Type:Protein phosphatase
Mol. Mass.:49963.76
Organism:Homo sapiens (Human)
Description:Human recombinant GST-fusion PTP1B (1-435).
Residue:435
BDBM50118093
NameBDBM50118093
Synonyms:(4-Hydroxy-phenyl)-oxo-acetic acid | CHEMBL129918
TypeSmall organic molecule
Emp. Form.C8H6O4
Mol. Mass.166.1308
SMILESOC(=O)C(=O)c1ccc(O)cc1