Reaction Details
TargetPlatelet-activating factor receptor
LigandBDBM50118201
Substrate/Competitorn/a
Meas. Tech.ChEMBL_155144 (CHEMBL760185)
Ki 150±n/a nM
Citation Strømgaard, KSaito, DRShindou, HIshii, SShimizu, TNakanishi, K Ginkgolide derivatives for photolabeling studies: preparation and pharmacological evaluation. J Med Chem45:4038-46 (2002) Platelet-activating factor receptor
Name:Platelet-activating factor receptor
Type:PROTEIN
Mol. Mass.:39163.36
Organism:Mus musculus
Description:ChEMBL_155144
Residue:341
BDBM50118201
NameBDBM50118201
Synonyms:6-(4-benzoylbenzyloxy)-8-(tert-butyl)-12,17-dihydroxy-16-methyl-2,4,14,19-tetraoxahexacyclo[8.7.2.01,11.03,7.07,11.013,17]nonadecane-5,15,18-trione | CHEMBL130606
TypeSmall organic molecule
Emp. Form.C34H34O11
Mol. Mass.618.6272
SMILESC[C@@H]1C(=O)O[C@H]2[C@H](O)[C@@]34C5C[C@@H](C(C)(C)C)C33C(OC(=O)[C@@H]3OCc3ccc(cc3)C(=O)c3ccccc3)OC4(C(=O)O5)[C@@]12O