Reaction Details
TargetPlatelet-activating factor receptor
LigandBDBM50118204
Substrate/Competitorn/a
Meas. Tech.ChEMBL_155144 (CHEMBL760185)
Ki 130±n/a nM
Citation Strømgaard, KSaito, DRShindou, HIshii, SShimizu, TNakanishi, K Ginkgolide derivatives for photolabeling studies: preparation and pharmacological evaluation. J Med Chem45:4038-46 (2002) Platelet-activating factor receptor
Name:Platelet-activating factor receptor
Type:PROTEIN
Mol. Mass.:39163.36
Organism:Mus musculus
Description:ChEMBL_155144
Residue:341
BDBM50118204
NameBDBM50118204
Synonyms:6-(4-benzoylphenylcarbonyloxy)-8-(tert-butyl)-12,17-dihydroxy-16-methyl-5,15,18-trioxo-2,4,14,19-tetraoxahexacyclo[8.7.2.01,11.03,7.07,11.013,17]nonadecane | CHEMBL335974
TypeSmall organic molecule
Emp. Form.C34H32O12
Mol. Mass.632.6107
SMILESC[C@@H]1C(=O)O[C@H]2[C@H](O)[C@@]34C5C[C@@H](C(C)(C)C)C33C(OC(=O)[C@@H]3OC(=O)c3ccc(cc3)C(=O)c3ccccc3)OC4(C(=O)O5)[C@@]12O