Reaction Details
TargetSodium-dependent dopamine transporter
LigandBDBM50118294
Substrate/Competitorn/a
Meas. Tech.ChEMBL_61671 (CHEMBL670049)
Ki 2.01±n/a nM
Citation Houlihan, WJAhmad, UFKoletar, JKelly, LBrand, LKopajtic, TA Benzo- and cyclohexanomazindol analogues as potential inhibitors of the cocaine binding site at the dopamine transporter. J Med Chem45:4110-8 (2002) Sodium-dependent dopamine transporter
Name:Sodium-dependent dopamine transporter
Type:Multi-pass membrane protein
Mol. Mass.:68497.11
Organism:Homo sapiens (Human)
Description:Q01959
Residue:620
BDBM50118294
NameBDBM50118294
Synonyms:7-(4-Chloro-phenyl)-7,8,9,10-tetrahydro-7a,11-diaza-benzo[c]fluoren-7-ol | CHEMBL334577
TypeSmall organic molecule
Emp. Form.C21H17ClN2O
Mol. Mass.348.825
SMILESOC1(N2CCCN=C2c2c1ccc1ccccc21)c1ccc(Cl)cc1