Reaction Details
TargetSodium-dependent noradrenaline transporter
LigandBDBM50118291
Substrate/Competitorn/a
Meas. Tech.ChEMBL_142614 (CHEMBL751152)
Ki 11±n/a nM
Citation Houlihan, WJAhmad, UFKoletar, JKelly, LBrand, LKopajtic, TA Benzo- and cyclohexanomazindol analogues as potential inhibitors of the cocaine binding site at the dopamine transporter. J Med Chem45:4110-8 (2002) Sodium-dependent noradrenaline transporter
Name:Sodium-dependent noradrenaline transporter
Type:Multi-pass membrane protein
Mol. Mass.:69337.72
Organism:Homo sapiens (Human)
Description:P23975
Residue:617
BDBM50118291
NameBDBM50118291
Synonyms:5-Naphthalen-2-yl-2,5-dihydro-3H-imidazo[2,1-a]isoindol-5-ol | CHEMBL132676
TypeSmall organic molecule
Emp. Form.C20H16N2O
Mol. Mass.300.3538
SMILESOC1(N2CCN=C2c2ccccc12)c1ccc2ccccc2c1