Reaction Details
TargetSodium-dependent dopamine transporter
LigandBDBM50118293
Substrate/Competitorn/a
Meas. Tech.ChEMBL_61671 (CHEMBL670049)
Ki 27.2±n/a nM
Citation Houlihan, WJAhmad, UFKoletar, JKelly, LBrand, LKopajtic, TA Benzo- and cyclohexanomazindol analogues as potential inhibitors of the cocaine binding site at the dopamine transporter. J Med Chem45:4110-8 (2002) Sodium-dependent dopamine transporter
Name:Sodium-dependent dopamine transporter
Type:Multi-pass membrane protein
Mol. Mass.:68497.11
Organism:Homo sapiens (Human)
Description:Q01959
Residue:620
BDBM50118293
NameBDBM50118293
Synonyms:7-(4-Chloro-phenyl)-8,9-dihydro-7H-7a,10-diaza-pentaleno[1,2-a]naphthalen-7-ol | CHEMBL133646
TypeSmall organic molecule
Emp. Form.C20H15ClN2O
Mol. Mass.334.799
SMILESOC1(N2CCN=C2c2c1ccc1ccccc21)c1ccc(Cl)cc1