Reaction Details
TargetPapain
LigandBDBM50409588
Substrate/Competitorn/a
Meas. Tech.ChEMBL_222141 (CHEMBL822229)
Ki 1.35±n/a nM
Citation Wieczerzak, EDrabik, PŁankiewicz, LOldziej, SGrzonka, ZAbrahamson, MGrubb, ABrömme, D Azapeptides structurally based upon inhibitory sites of cystatins as potent and selective inhibitors of cysteine proteases. J Med Chem45:4202-11 (2002) Papain
Name:Papain
Type:Enzyme
Mol. Mass.:38923.01
Organism:Carica papaya
Description:Papain was purchased from Sigma, Germany.
Residue:345
BDBM50409588
NameBDBM50409588
Synonyms:CHEMBL2028919
TypeSmall organic molecule
Emp. Form.C42H64N8O8
Mol. Mass.809.0064
SMILESCC[C@H](C)[C@H](NC(=O)NNC(=O)[C@H](CC(C)C)NC(=O)[C@H](CC(C)C)NC(=O)[C@H](C)NC(=O)OCc1ccccc1)C(=O)N[C@@H](C(C)C)C(=O)NCc1ccccc1