Reaction Details
TargetPapain
LigandBDBM50409589
Substrate/Competitorn/a
Meas. Tech.ChEMBL_222141 (CHEMBL822229)
Ki 0.1±n/a nM
Citation Wieczerzak, EDrabik, PŁankiewicz, LOldziej, SGrzonka, ZAbrahamson, MGrubb, ABrömme, D Azapeptides structurally based upon inhibitory sites of cystatins as potent and selective inhibitors of cysteine proteases. J Med Chem45:4202-11 (2002) Papain
Name:Papain
Type:Enzyme
Mol. Mass.:38923.01
Organism:Carica papaya
Description:Papain was purchased from Sigma, Germany.
Residue:345
BDBM50409589
NameBDBM50409589
Synonyms:CHEMBL2028920
TypeSmall organic molecule
Emp. Form.C43H59N7O9
Mol. Mass.817.9701
SMILESCC[C@H](C)[C@H](NC(=O)NNC(=O)[C@H](Cc1cccc2ccccc12)NC(=O)[C@H](CC(C)C)NC(=O)[C@H](C)NC(=O)OCc1ccccc1)C(=O)N[C@@H](C(C)C)C(=O)OC