Reaction Details
TargetPapain
LigandBDBM50409593
Substrate/Competitorn/a
Meas. Tech.ChEMBL_222141 (CHEMBL822229)
Ki 100±n/a nM
Citation Wieczerzak, EDrabik, PŁankiewicz, LOldziej, SGrzonka, ZAbrahamson, MGrubb, ABrömme, D Azapeptides structurally based upon inhibitory sites of cystatins as potent and selective inhibitors of cysteine proteases. J Med Chem45:4202-11 (2002) Papain
Name:Papain
Type:Enzyme
Mol. Mass.:38923.01
Organism:Carica papaya
Description:Papain was purchased from Sigma, Germany.
Residue:345
BDBM50409593
NameBDBM50409593
Synonyms:CHEMBL2028913
TypeSmall organic molecule
Emp. Form.C45H67N13O9
Mol. Mass.934.0952
SMILESCC(C)C[C@H](NC(=O)[C@H](CCCNC(N)=N)NC(=O)OCc1ccccc1)C(=O)N[C@@H](C(C)C)C(=O)NNC(=O)N[C@@H](Cc1c[nH]c2ccccc12)C(=O)N[C@@H](C(C)C)C(=O)N[C@@H](C)C(N)=O