Reaction Details
TargetPapain
LigandBDBM50409596
Substrate/Competitorn/a
Meas. Tech.ChEMBL_222141 (CHEMBL822229)
Ki 28±n/a nM
Citation Wieczerzak, EDrabik, PŁankiewicz, LOldziej, SGrzonka, ZAbrahamson, MGrubb, ABrömme, D Azapeptides structurally based upon inhibitory sites of cystatins as potent and selective inhibitors of cysteine proteases. J Med Chem45:4202-11 (2002) Papain
Name:Papain
Type:Enzyme
Mol. Mass.:38923.01
Organism:Carica papaya
Description:Papain was purchased from Sigma, Germany.
Residue:345
BDBM50409596
NameBDBM50409596
Synonyms:CHEMBL2028923
TypeSmall organic molecule
Emp. Form.C21H33N5O4
Mol. Mass.419.5178
SMILESCCCCNC(=O)[C@@H](NC(=O)NNC(=O)[C@H](Cc1ccccc1)NC(C)=O)C(C)C