Reaction Details
TargetPapain
LigandBDBM50409597
Substrate/Competitorn/a
Meas. Tech.ChEMBL_222141 (CHEMBL822229)
Ki 0.28±n/a nM
Citation Wieczerzak, EDrabik, PŁankiewicz, LOldziej, SGrzonka, ZAbrahamson, MGrubb, ABrömme, D Azapeptides structurally based upon inhibitory sites of cystatins as potent and selective inhibitors of cysteine proteases. J Med Chem45:4202-11 (2002) Papain
Name:Papain
Type:Enzyme
Mol. Mass.:38923.01
Organism:Carica papaya
Description:Papain was purchased from Sigma, Germany.
Residue:345
BDBM50409597
NameBDBM50409597
Synonyms:CHEMBL2028912
TypeSmall organic molecule
Emp. Form.C40H59N7O10
Mol. Mass.797.9374
SMILESCC[C@H](C)[C@H](NC(=O)NNC(=O)[C@H](Cc1ccc(OC)cc1)NC(=O)[C@H](CC(C)C)NC(=O)[C@H](C)NC(=O)OCc1ccccc1)C(=O)N[C@@H](C(C)C)C(=O)OC