Reaction Details
TargetMelatonin receptor type 1A/1B
LigandBDBM50118436
Substrate/Competitorn/a
Meas. Tech.ChEMBL_104946 (CHEMBL713113)
Ki 0.098400±n/a nM
Citation Fukatsu, KUchikawa, OKawada, MYamano, TYamashita, MKato, KHirai, KHinuma, SMiyamoto, MOhkawa, S Synthesis of a novel series of benzocycloalkene derivatives as melatonin receptor agonists. J Med Chem45:4212-21 (2002) Melatonin receptor type 1A/1B
Name:Melatonin receptor type 1A/1B
Synonyms:Melatonin receptor
Type:n/a
Mol. Mass.:n/a
Description:ASSAY_ID of ChEMBL is 104946
Components:This complex has 2 components.
Component 1
Name:Melatonin receptor type 1A
Type:Enzyme
Mol. Mass.:39392.94
Organism:Homo sapiens (Human)
Description:P48039
Residue:350
Component 2
Name:Melatonin receptor type 1B
Synonyms:MTNR1B Mel-1B-R Melatonin 1B Melatonin receptor type 1B | Melatonin receptor type 2 (MT2)
Type:Enzyme
Mol. Mass.:40203.54
Organism:Homo sapiens (Human)
Description:P49286
Residue:362
BDBM50118436
NameBDBM50118436
Synonyms:2,2,2-Trifluoro-N-[2-(6-methoxy-5-methyl-indan-1-yl)-ethyl]-acetamide | CHEMBL135136
TypeSmall organic molecule
Emp. Form.C15H18F3NO2
Mol. Mass.301.3041
SMILESCOc1cc2C(CCNC(=O)C(F)(F)F)CCc2cc1C