Reaction Details
TargetMelatonin receptor type 1A/1B
LigandBDBM50118431
Substrate/Competitorn/a
Meas. Tech.ChEMBL_104946 (CHEMBL713113)
Ki 30±n/a nM
Citation Fukatsu, KUchikawa, OKawada, MYamano, TYamashita, MKato, KHirai, KHinuma, SMiyamoto, MOhkawa, S Synthesis of a novel series of benzocycloalkene derivatives as melatonin receptor agonists. J Med Chem45:4212-21 (2002) Melatonin receptor type 1A/1B
Name:Melatonin receptor type 1A/1B
Synonyms:Melatonin receptor
Type:n/a
Mol. Mass.:n/a
Description:ASSAY_ID of ChEMBL is 104946
Components:This complex has 2 components.
Component 1
Name:Melatonin receptor type 1A
Type:Enzyme
Mol. Mass.:39392.94
Organism:Homo sapiens (Human)
Description:P48039
Residue:350
Component 2
Name:Melatonin receptor type 1B
Synonyms:MTNR1B Mel-1B-R Melatonin 1B Melatonin receptor type 1B | Melatonin receptor type 2 (MT2)
Type:Enzyme
Mol. Mass.:40203.54
Organism:Homo sapiens (Human)
Description:P49286
Residue:362
BDBM50118431
NameBDBM50118431
Synonyms:(R) N-[2-(6-Methoxy-indan-1-yl)-ethyl]-propionamide | CHEMBL336642
TypeSmall organic molecule
Emp. Form.C15H21NO2
Mol. Mass.247.3327
SMILESCCC(=O)NCC[C@H]1CCc2ccc(OC)cc12