Reaction Details
TargetRibosyldihydronicotinamide dehydrogenase [quinone]
LigandBDBM50118437
Substrate/Competitorn/a
Meas. Tech.ChEMBL_104940 (CHEMBL714719)
Ki 467±n/a nM
Citation Fukatsu, KUchikawa, OKawada, MYamano, TYamashita, MKato, KHirai, KHinuma, SMiyamoto, MOhkawa, S Synthesis of a novel series of benzocycloalkene derivatives as melatonin receptor agonists. J Med Chem45:4212-21 (2002) Ribosyldihydronicotinamide dehydrogenase [quinone]
Name:Ribosyldihydronicotinamide dehydrogenase [quinone]
Type:Protein
Mol. Mass.:25917.25
Organism:Homo sapiens (Human)
Description:P16083
Residue:231
BDBM50118437
NameBDBM50118437
Synonyms:(Z) N-[2-(6-Methoxy-indan-1-ylidene)-ethyl]-propionamide | CHEMBL134588
TypeSmall organic molecule
Emp. Form.C15H19NO2
Mol. Mass.245.3169
SMILESCCC(=O)NC\C=C1\CCc2ccc(OC)cc12