Reaction Details
TargetMelatonin receptor type 1B
LigandBDBM50118470
Substrate/Competitorn/a
Meas. Tech.ChEMBL_105275 (CHEMBL718943)
Ki 0.045±n/a nM
Citation Uchikawa, OFukatsu, KTokunoh, RKawada, MMatsumoto, KImai, YHinuma, SKato, KNishikawa, HHirai, KMiyamoto, MOhkawa, S Synthesis of a novel series of tricyclic indan derivatives as melatonin receptor agonists. J Med Chem45:4222-39 (2002) Melatonin receptor type 1B
Name:Melatonin receptor type 1B
Type:Enzyme
Mol. Mass.:40203.54
Organism:Homo sapiens (Human)
Description:P49286
Residue:362
BDBM50118470
NameBDBM50118470
Synonyms:CHEMBL1218 RAMELTEON | Rozerem
TypeSmall organic molecule
Emp. Form.C16H21NO2
Mol. Mass.259.3434
SMILESCCC(=O)NCC[C@@H]1CCc2ccc3OCCc3c12