Reaction Details
TargetTranslocator protein
LigandBDBM50118531
Substrate/Competitorn/a
Meas. Tech.ChEMBL_37199 (CHEMBL650800)
Ki 11±n/a nM
Citation Campiani, GRamunno, AFiorini, INacci, VMorelli, ENovellino, EGoegan, MMennini, TSullivan, SZisterer, DMWilliams, CD Synthesis of new molecular probes for investigation of steroid biosynthesis induced by selective interaction with peripheral type benzodiazepine receptors (PBR). J Med Chem45:4276-81 (2002) Translocator protein
Name:Translocator protein
Type:Mitochondrion membrane protein
Mol. Mass.:18945.84
Organism:Rattus norvegicus (rat)
Description:Competitive binding experiments were performed on rat kidney mitochondrial membranes.
Residue:169
BDBM50118531
NameBDBM50118531
Synonyms:CHEMBL135327 | Diethyl-carbamic acid 5-phenyl-6-oxa-10,10b-diaza-benzo[e]azulen-4-yl ester
TypeSmall organic molecule
Emp. Form.C22H21N3O3
Mol. Mass.375.4204
SMILESCCN(CC)C(=O)OC1=C(Oc2cccnc2-n2cccc12)c1ccccc1