Reaction Details
TargetTranslocator protein
LigandBDBM50118533
Substrate/Competitorn/a
Meas. Tech.ChEMBL_37198 (CHEMBL650799)
Ki 5.7±n/a nM
Citation Campiani, GRamunno, AFiorini, INacci, VMorelli, ENovellino, EGoegan, MMennini, TSullivan, SZisterer, DMWilliams, CD Synthesis of new molecular probes for investigation of steroid biosynthesis induced by selective interaction with peripheral type benzodiazepine receptors (PBR). J Med Chem45:4276-81 (2002) Translocator protein
Name:Translocator protein
Type:Mitochondrion membrane protein
Mol. Mass.:18945.84
Organism:Rattus norvegicus (rat)
Description:Competitive binding experiments were performed on rat kidney mitochondrial membranes.
Residue:169
BDBM50118533
NameBDBM50118533
Synonyms:CHEMBL336903 | Diethyl-carbamic acid 5-phenyl-6H-benzo[f]pyrrolo[1,2-a]azepin-4-yl ester
TypeSmall organic molecule
Emp. Form.C24H24N2O2
Mol. Mass.372.4596
SMILESCCN(CC)C(=O)OC1=C(Cc2ccccc2-n2cccc12)c1ccccc1