Reaction Details
TargetTranslocator protein
LigandBDBM50118530
Substrate/Competitorn/a
Meas. Tech.ChEMBL_37199 (CHEMBL650800)
Ki 6±n/a nM
Citation Campiani, GRamunno, AFiorini, INacci, VMorelli, ENovellino, EGoegan, MMennini, TSullivan, SZisterer, DMWilliams, CD Synthesis of new molecular probes for investigation of steroid biosynthesis induced by selective interaction with peripheral type benzodiazepine receptors (PBR). J Med Chem45:4276-81 (2002) Translocator protein
Name:Translocator protein
Type:Mitochondrion membrane protein
Mol. Mass.:18945.84
Organism:Rattus norvegicus (rat)
Description:Competitive binding experiments were performed on rat kidney mitochondrial membranes.
Residue:169
BDBM50118530
NameBDBM50118530
Synonyms:Azetidine-1-carboxylic acid 5-phenyl-6-oxa-10b-aza-benzo[e]azulen-4-yl ester | CHEMBL132915
TypeSmall organic molecule
Emp. Form.C22H18N2O3
Mol. Mass.358.3899
SMILESO=C(OC1=C(Oc2ccccc2-n2cccc12)c1ccccc1)N1CCC1