Reaction Details
TargetSodium-dependent dopamine transporter
LigandBDBM50118598
Substrate/Competitorn/a
Meas. Tech.ChEMBL_62946 (CHEMBL675530)
Ki 0.45±n/a nM
Citation Prisinzano, TGreiner, EJohnson, EMDersch, CMMarcus, JPartilla, JSRothman, RBJacobson, AERice, KC Piperidine analogues of 1-[2-[bis(4-fluorophenyl)methoxy]ethyl]-4-(3-phenylpropyl)piperazine (GBR 12909): high affinity ligands for the dopamine transporter. J Med Chem45:4371-4 (2002) Sodium-dependent dopamine transporter
Name:Sodium-dependent dopamine transporter
Type:Multi-pass membrane protein
Mol. Mass.:68497.11
Organism:Homo sapiens (Human)
Description:Q01959
Residue:620
BDBM50118598
NameBDBM50118598
Synonyms:4-{2-[Bis-(4-fluoro-phenyl)-methoxy]-ethyl}-1-(3-phenyl-allyl)-piperidine | CHEMBL137718
TypeSmall organic molecule
Emp. Form.C29H31F2NO
Mol. Mass.447.5593
SMILESFc1ccc(cc1)C(OCCC1CCN(C\C=C\c2ccccc2)CC1)c1ccc(F)cc1