Reaction Details
TargetGlutathionylspermidine synthase
LigandBDBM50118639
Substrate/Competitorn/a
Meas. Tech.ChEMBL_72764 (CHEMBL879021)
Ki 32000±n/a nM
Citation Amssoms, KOza, SLAugustyns, KYamani, ALambeir, AMBal, GVan der Veken, PFairlamb, AHHaemers, A Glutathione-like tripeptides as inhibitors of glutathionylspermidine synthetase. Part 2: substitution of the glycine part. Bioorg Med Chem Lett12:2703-5 (2002) Glutathionylspermidine synthase
Name:Glutathionylspermidine synthase
Type:PROTEIN
Mol. Mass.:80299.94
Organism:Crithidia fasciculata
Description:ChEMBL_72759
Residue:719
BDBM50118639
NameBDBM50118639
Synonyms:6-(4-Amino-butylamino)-2-[(S)-2-((S)-4-amino-4-carboxy-butyrylamino)-4-methyl-pentanoylamino]-hexanoic acid | CHEMBL88662
TypeSmall organic molecule
Emp. Form.C21H41N5O6
Mol. Mass.459.5801
SMILESCC(C)C[C@H](NC(=O)CC[C@H](N)C(O)=O)C(=O)N[C@@H](CCCCNCCCCN)C(O)=O