Reaction Details
TargetGlutathionylspermidine synthase
LigandBDBM50118642
Substrate/Competitorn/a
Meas. Tech.ChEMBL_72764 (CHEMBL879021)
Ki 10000±n/a nM
Citation Amssoms, KOza, SLAugustyns, KYamani, ALambeir, AMBal, GVan der Veken, PFairlamb, AHHaemers, A Glutathione-like tripeptides as inhibitors of glutathionylspermidine synthetase. Part 2: substitution of the glycine part. Bioorg Med Chem Lett12:2703-5 (2002) Glutathionylspermidine synthase
Name:Glutathionylspermidine synthase
Type:PROTEIN
Mol. Mass.:80299.94
Organism:Crithidia fasciculata
Description:ChEMBL_72759
Residue:719
BDBM50118642
NameBDBM50118642
Synonyms:5-Amino-2-[(S)-2-((S)-4-amino-4-carboxy-butyrylamino)-4-methyl-pentanoylamino]-pentanoic acid | CHEMBL328493
TypeSmall organic molecule
Emp. Form.C16H30N4O6
Mol. Mass.374.4326
SMILESCC(C)C[C@H](NC(=O)CC[C@H](N)C(O)=O)C(=O)N[C@@H](CCCN)C(O)=O