Reaction Details
TargetSorbitol dehydrogenase
LigandBDBM50118709
Substrate/Competitorn/a
Meas. Tech.ChEMBL_223910 (CHEMBL844302)
IC50 7±n/a nM
Citation Mylari, BLOates, PJZembrowski, WJBeebe, DAConn, ELCoutcher, JBO'Gorman, MTLinhares, MCWithbroe, GJ A sorbitol dehydrogenase inhibitor of exceptional in vivo potency with a long duration of action: 1-(R)-[4-[4-(4,6-dimethyl[1,3,5]triazin-2-yl)- 2R,6S-dimethylpiperazin-1-yl]pyrimidin-2- yl]ethanol. J Med Chem45:4398-401 (2002) Sorbitol dehydrogenase
Name:Sorbitol dehydrogenase
Type:PROTEIN
Mol. Mass.:38332.20
Organism:Homo sapiens (Human)
Description:ChEMBL_223910
Residue:357
BDBM50118709
NameBDBM50118709
Synonyms:1-{4-[2,6-Dimethyl-4-(4-methyl-[1,3,5]triazin-2-yl)-piperazin-1-yl]-pyrimidin-2-yl}-ethanol | CHEMBL342697
TypeSmall organic molecule
Emp. Form.C16H23N7O
Mol. Mass.329.4001
SMILESC[C@@H](O)c1nccc(n1)N1[C@@H](C)CN(C[C@H]1C)c1ncnc(C)n1