Reaction Details
TargetSorbitol dehydrogenase
LigandBDBM50118708
Substrate/Competitorn/a
Meas. Tech.ChEMBL_223917 (CHEMBL846063)
IC50 10±n/a nM
Citation Mylari, BLOates, PJZembrowski, WJBeebe, DAConn, ELCoutcher, JBO'Gorman, MTLinhares, MCWithbroe, GJ A sorbitol dehydrogenase inhibitor of exceptional in vivo potency with a long duration of action: 1-(R)-[4-[4-(4,6-dimethyl[1,3,5]triazin-2-yl)- 2R,6S-dimethylpiperazin-1-yl]pyrimidin-2- yl]ethanol. J Med Chem45:4398-401 (2002) Sorbitol dehydrogenase
Name:Sorbitol dehydrogenase
Type:PROTEIN
Mol. Mass.:38239.67
Organism:Rattus norvegicus
Description:ChEMBL_223914
Residue:357
BDBM50118708
NameBDBM50118708
Synonyms:1-{4-[2,6-Dimethyl-4-(4-phenyl-[1,3,5]triazin-2-yl)-piperazin-1-yl]-pyrimidin-2-yl}-ethanol | CHEMBL136103
TypeSmall organic molecule
Emp. Form.C21H25N7O
Mol. Mass.391.4695
SMILESC[C@@H](O)c1nccc(n1)N1[C@@H](C)CN(C[C@H]1C)c1ncnc(n1)-c1ccccc1