Reaction Details
TargetReceptor-type tyrosine-protein phosphatase F
LigandBDBM50118764
Substrate/Competitorn/a
Meas. Tech.ChEMBL_162594 (CHEMBL768410)
pH5.5±n/a
Ki 90000±n/a nM
Commentsextracted
Citation Andersen, HSOlsen, OHIversen, LFSørensen, ALMortensen, SBChristensen, MSBranner, SHansen, TKLau, JFJeppesen, LMoran, EJSu, JBakir, FJudge, LShahbaz, MCollins, TVo, TNewman, MJRipka, WCMøller, NP Discovery and SAR of a novel selective and orally bioavailable nonpeptide classical competitive inhibitor class of protein-tyrosine phosphatase 1B. J Med Chem45:4443-59 (2002) Receptor-type tyrosine-protein phosphatase F
Name:Receptor-type tyrosine-protein phosphatase F
Type:Protein
Mol. Mass.:212869.85
Organism:Homo sapiens (Human)
Description:P10586
Residue:1907
BDBM50118764
NameBDBM50118764
Synonyms:3-(carboxyformamido)-5-(thiophen-3-yl)thiophene-2-carboxylic acid 4-(carboxyformamido)-2,3'-bithiophene-5-carboxylic acid | CHEMBL138575
TypeSmall organic molecule
Emp. Form.C11H7NO5S2
Mol. Mass.297.307
SMILESOC(=O)C(=O)Nc1cc(sc1C(O)=O)-c1ccsc1