Reaction Details
TargetTyrosine-protein phosphatase non-receptor type 1
LigandBDBM50118742
Substrate/Competitorn/a
Meas. Tech.ChEMBL_162283 (CHEMBL770981)
pH5.5±n/a
Ki 1000±n/a nM
Commentsextracted
Citation Andersen, HSOlsen, OHIversen, LFSørensen, ALMortensen, SBChristensen, MSBranner, SHansen, TKLau, JFJeppesen, LMoran, EJSu, JBakir, FJudge, LShahbaz, MCollins, TVo, TNewman, MJRipka, WCMøller, NP Discovery and SAR of a novel selective and orally bioavailable nonpeptide classical competitive inhibitor class of protein-tyrosine phosphatase 1B. J Med Chem45:4443-59 (2002) Tyrosine-protein phosphatase non-receptor type 1
Name:Tyrosine-protein phosphatase non-receptor type 1
Type:Protein phosphatase
Mol. Mass.:49963.76
Organism:Homo sapiens (Human)
Description:Human recombinant GST-fusion PTP1B (1-435).
Residue:435
BDBM50118742
NameBDBM50118742
Synonyms:2-(Oxalyl-amino)-6-pyridin-2-ylmethyl-4,5,6,7-tetrahydro-thieno[2,3-c]pyridine-3-carboxylic acid | CHEMBL138277
TypeSmall organic molecule
Emp. Form.C16H15N3O5S
Mol. Mass.361.372
SMILESOC(=O)C(=O)Nc1sc2CN(Cc3ccccn3)CCc2c1C(O)=O