Reaction Details
TargetReceptor-type tyrosine-protein phosphatase alpha
LigandBDBM50118775
Substrate/Competitorn/a
Meas. Tech.ChEMBL_162603 (CHEMBL771315)
pH5.5±n/a
Ki 93000±n/a nM
Commentsextracted
Citation Andersen, HSOlsen, OHIversen, LFSørensen, ALMortensen, SBChristensen, MSBranner, SHansen, TKLau, JFJeppesen, LMoran, EJSu, JBakir, FJudge, LShahbaz, MCollins, TVo, TNewman, MJRipka, WCMøller, NP Discovery and SAR of a novel selective and orally bioavailable nonpeptide classical competitive inhibitor class of protein-tyrosine phosphatase 1B. J Med Chem45:4443-59 (2002) Receptor-type tyrosine-protein phosphatase alpha
Name:Receptor-type tyrosine-protein phosphatase alpha
Type:Enzyme
Mol. Mass.:90719.02
Organism:Homo sapiens (Human)
Description:P18433
Residue:802
BDBM50118775
NameBDBM50118775
Synonyms:3-(Oxalyl-amino)-5-(4-phenoxy-phenyl)-thiophene-2-carboxylic acid CHEMBL138659
TypeSmall organic molecule
Emp. Form.C19H13NO6S
Mol. Mass.383.375
SMILESOC(=O)C(=O)Nc1cc(sc1C(O)=O)-c1ccc(Oc2ccccc2)cc1