Reaction Details
TargetReceptor-type tyrosine-protein phosphatase alpha
LigandBDBM50118758
Substrate/Competitorn/a
Meas. Tech.ChEMBL_162603 (CHEMBL771315)
pH5.5±n/a
Ki 250000±n/a nM
Commentsextracted
Citation Andersen, HSOlsen, OHIversen, LFSørensen, ALMortensen, SBChristensen, MSBranner, SHansen, TKLau, JFJeppesen, LMoran, EJSu, JBakir, FJudge, LShahbaz, MCollins, TVo, TNewman, MJRipka, WCMøller, NP Discovery and SAR of a novel selective and orally bioavailable nonpeptide classical competitive inhibitor class of protein-tyrosine phosphatase 1B. J Med Chem45:4443-59 (2002) Receptor-type tyrosine-protein phosphatase alpha
Name:Receptor-type tyrosine-protein phosphatase alpha
Type:Enzyme
Mol. Mass.:90719.02
Organism:Homo sapiens (Human)
Description:P18433
Residue:802
BDBM50118758
NameBDBM50118758
Synonyms:5-(3-Amino-phenyl)-3-(oxalyl-amino)-thiophene-2-carboxylic acid CHEMBL139590
TypeSmall organic molecule
Emp. Form.C13H10N2O5S
Mol. Mass.306.294
SMILESNc1cccc(c1)-c1cc(NC(=O)C(O)=O)c(s1)C(O)=O