Reaction Details
TargetReceptor-type tyrosine-protein phosphatase alpha
LigandBDBM50118747
Substrate/Competitorn/a
Meas. Tech.ChEMBL_162603 (CHEMBL771315)
pH5.5±n/a
Ki 250000±n/a nM
Commentsextracted
Citation Andersen, HSOlsen, OHIversen, LFSørensen, ALMortensen, SBChristensen, MSBranner, SHansen, TKLau, JFJeppesen, LMoran, EJSu, JBakir, FJudge, LShahbaz, MCollins, TVo, TNewman, MJRipka, WCMøller, NP Discovery and SAR of a novel selective and orally bioavailable nonpeptide classical competitive inhibitor class of protein-tyrosine phosphatase 1B. J Med Chem45:4443-59 (2002) Receptor-type tyrosine-protein phosphatase alpha
Name:Receptor-type tyrosine-protein phosphatase alpha
Type:Enzyme
Mol. Mass.:90719.02
Organism:Homo sapiens (Human)
Description:P18433
Residue:802
BDBM50118747
NameBDBM50118747
Synonyms:3-(Oxalyl-amino)-5-phenyl-thiophene-2-carboxylic acid CHEMBL137867
TypeSmall organic molecule
Emp. Form.C13H9NO5S
Mol. Mass.291.279
SMILESOC(=O)C(=O)Nc1cc(sc1C(O)=O)-c1ccccc1