Reaction Details
TargetReceptor-type tyrosine-protein phosphatase alpha
LigandBDBM50118785
Substrate/Competitorn/a
Meas. Tech.ChEMBL_162603 (CHEMBL771315)
pH5.5±n/a
Ki 320000±n/a nM
Commentsextracted
Citation Andersen, HSOlsen, OHIversen, LFSørensen, ALMortensen, SBChristensen, MSBranner, SHansen, TKLau, JFJeppesen, LMoran, EJSu, JBakir, FJudge, LShahbaz, MCollins, TVo, TNewman, MJRipka, WCMøller, NP Discovery and SAR of a novel selective and orally bioavailable nonpeptide classical competitive inhibitor class of protein-tyrosine phosphatase 1B. J Med Chem45:4443-59 (2002) Receptor-type tyrosine-protein phosphatase alpha
Name:Receptor-type tyrosine-protein phosphatase alpha
Type:Enzyme
Mol. Mass.:90719.02
Organism:Homo sapiens (Human)
Description:P18433
Residue:802
BDBM50118785
NameBDBM50118785
Synonyms:2-(Oxalyl-amino)-5,6,7,8-tetrahydro-4H-cyclohepta[b]thiophene-3-carboxylic acid CHEMBL138151
TypeSmall organic molecule
Emp. Form.C12H13NO5S
Mol. Mass.283.3
SMILESOC(=O)C(=O)Nc1sc2CCCCCc2c1C(O)=O