Reaction Details
TargetVascular endothelial growth factor receptor 2
LigandBDBM50118955
Substrate/Competitorn/a
Meas. Tech.ChEBML_214500
IC50 19±n/a nM
Citation Gingrich, DEHudkins, RL Synthesis and kinase inhibitory activity of 3'-(S)-epi-K-252a. Bioorg Med Chem Lett12:2829-31 (2002) Vascular endothelial growth factor receptor 2
Name:Vascular endothelial growth factor receptor 2
Type:Receptor Tyrosine Kinase
Mol. Mass.:151510.97
Organism:Homo sapiens (Human)
Description:P35968
Residue:1356
BDBM50118955
NameBDBM50118955
Synonyms:CHEMBL94678 | Compound K-252a(epi)
TypeSmall organic molecule
Emp. Form.C27H21N3O5
Mol. Mass.467.4727
SMILESCOC(=O)[C@]1(O)C[C@H]2O[C@]1(C)n1c3ccccc3c3c4CNC(=O)c4c4c5ccccc5n2c4c13