Reaction Details
TargetGag-Pol polyprotein [489-587]
LigandBDBM50076986
Substrate/Competitorn/a
Meas. Tech.ChEMBL_159288 (CHEMBL764271)
IC50<0.200000±n/a nM
Citation Raghavan, SYang, ZMosley, RTSchleif, WAGabryelski, LOlsen, DBStahlhut, MKuo, LCEmini, EAChapman, KTTata, JR Combinatorial library of indinavir analogues: replacement for the aminoindanol at P2'. Bioorg Med Chem Lett12:2855-8 (2002) Gag-Pol polyprotein [489-587]
Name:Gag-Pol polyprotein [489-587]
Type:Enzyme Subunit
Mol. Mass.:10781.16
Organism:Human immunodeficiency virus type 1
Description:P04585[489-587]
Residue:99
BDBM50076986
NameBDBM50076986
Synonyms:CHEMBL95733
TypeSmall organic molecule
Emp. Form.C39H50N6O6S3
Mol. Mass.795.046
SMILESCSc1nccc(n1)-c1ccc(s1)S(=O)(=O)N1CCN(C[C@H](O)C[C@@H](Cc2ccccc2)C(=O)NCc2c(C)cc(O)cc2C)[C@H](C1)C(=O)NC(C)(C)C