Reaction Details
TargetEstrogen receptor beta
LigandBDBM17292
Substrate/Competitorn/a
Meas. Tech.ChEBML_67835
IC50 2±n/a nM
Citation Smith, RAChen, JMader, MMMuegge, IMoehler, UKatti, SMarrero, DStirtan, WGWeaver, DRXiao, HCarley, W Solid-phase synthesis and investigation of benzofurans as selective estrogen receptor modulators. Bioorg Med Chem Lett12:2875-8 (2002) Estrogen receptor beta
Name:Estrogen receptor beta
Type:PROTEIN
Mol. Mass.:59173.80
Organism:Rattus norvegicus
Description:ChEMBL_803011
Residue:530
BDBM17292
NameBDBM17292
Synonyms:(1S,10R,11S,14S,15S)-15-methyltetracyclo[8.7.0.0^{2,7}.0^{11,15}]heptadeca-2,4,6-triene-5,14-diol 17α-ethinylestradiol CHEMBL135 ESTRADIOL Ovocyclin US9040509, E2 US9561238, E2 [2,4,6,7-3H]-E2 [3H]]estradiol
TypeSteroid
Emp. Form.C18H24O2
Mol. Mass.272.382
SMILES[H][C@@]12CC[C@H](O)[C@@]1(C)CC[C@]1([H])c3ccc(O)cc3CC[C@@]21[H]