Reaction Details
TargetIntegrin alpha-4/beta-1
LigandBDBM50119095
Substrate/Competitorn/a
Meas. Tech.ChEMBL_217453 (CHEMBL823502)
IC50 82±n/a nM
Citation Castanedo, GMSailes, FCDubree, NJNicholas, JBCaris, LClark, KKeating, SMBeresini, MHChiu, HFong, SMarsters, JCJackson, DYSutherlin, DP Solid-phase synthesis of dual alpha4beta1/alpha4beta7 integrin antagonists: two scaffolds with overlapping pharmacophores. Bioorg Med Chem Lett12:2913-7 (2002) Integrin alpha-4/beta-1
Name:Integrin alpha-4/beta-1
Type:n/a
Mol. Mass.:n/a
Description:ASSAY_ID of EBI is 88912
Components:This complex has 2 components.
Component 1
Name:Integrin beta-1
Synonyms:CD_antigen=CD29 Fibronectin receptor beta GPIIA ITGB1 MDF2 | MSK12
Type:Enzyme
Mol. Mass.:88400.38
Organism:Homo sapiens (Human)
Description:P05556
Residue:798
Component 2
Name:Integrin alpha-4
Synonyms:CD49 antigen-like family member D CD49d antigen ITA4_HUMAN Integrin alpha-4 Integrin alpha-IV VLA-4 integrin alpha 4 precursor | integrin alpha-4 precursor
Type:Membrane Protein
Mol. Mass.:114897.35
Organism:Homo sapiens (Human)
Description:P13612
Residue:1032
BDBM50119095
NameBDBM50119095
Synonyms:(S)-2-(2-Chloro-benzoylamino)-3-{2'-[(3-methyl-butylamino)-methyl]-biphenyl-4-yl}-propionic acid | CHEMBL98487
TypeSmall organic molecule
Emp. Form.C28H31ClN2O3
Mol. Mass.479.01
SMILESCC(C)CCNCc1ccccc1-c1ccc(C[C@H](NC(=O)c2ccccc2Cl)C(O)=O)cc1