Reaction Details
TargetAdenosine receptor A2a
LigandBDBM50119141
Substrate/Competitorn/a
Meas. Tech.ChEMBL_30140 (CHEMBL640587)
Ki 220±n/a nM
Citation Palle, VPElzein, EOGothe, SALi, ZGao, ZMeyer, SBlackburn, BZablocki, JA Structure-affinity relationships of the affinity of 2-pyrazolyl adenosine analogues for the adenosine A2A receptor. Bioorg Med Chem Lett12:2935-9 (2002) Adenosine receptor A2a
Name:Adenosine receptor A2a
Type:G Protein-Coupled Receptor (GPCR)
Mol. Mass.:45015.65
Organism:Rattus norvegicus (rat)
Description:Rat A2A receptors expressed in CHO cells.
Residue:410
BDBM50119141
NameBDBM50119141
Synonyms:(2R,3R,4S,5R)-2-[6-Amino-2-(1-cyclohexylmethyl-1H-pyrazol-4-yl)-purin-9-yl]-5-hydroxymethyl-tetrahydro-furan-3,4-diol | CHEMBL99983
TypeSmall organic molecule
Emp. Form.C20H27N7O4
Mol. Mass.429.4729
SMILESNc1nc(nc2n(cnc12)[C@@H]1O[C@H](CO)[C@@H](O)[C@H]1O)-c1cnn(CC2CCCCC2)c1