Reaction Details
TargetAdenosine receptor A2a
LigandBDBM50119134
Substrate/Competitorn/a
Meas. Tech.ChEMBL_30283 (CHEMBL642078)
Ki 20±n/a nM
Citation Palle, VPElzein, EOGothe, SALi, ZGao, ZMeyer, SBlackburn, BZablocki, JA Structure-affinity relationships of the affinity of 2-pyrazolyl adenosine analogues for the adenosine A2A receptor. Bioorg Med Chem Lett12:2935-9 (2002) Adenosine receptor A2a
Name:Adenosine receptor A2a
Type:G Protein-Coupled Receptor (GPCR)
Mol. Mass.:44716.46
Organism:Homo sapiens (Human)
Description:P29274
Residue:412
BDBM50119134
NameBDBM50119134
Synonyms:(2R,3R,4S,5R)-2-(6-Amino-2-{N'-[1-cyclohexyl-meth-(Z)-ylidene]-hydrazino}-purin-9-yl)-5-hydroxymethyl-tetrahydro-furan-3,4-diol | CHEMBL102116
TypeSmall organic molecule
Emp. Form.C17H25N7O4
Mol. Mass.391.4249
SMILESNc1nc(N=NCC2CCCCC2)nc2n(cnc12)[C@@H]1O[C@H](CO)[C@@H](O)[C@H]1O