Reaction Details
TargetAdenosine receptor A2a
LigandBDBM50119161
Substrate/Competitorn/a
Meas. Tech.ChEMBL_30140 (CHEMBL640587)
Ki 210±n/a nM
Citation Palle, VPElzein, EOGothe, SALi, ZGao, ZMeyer, SBlackburn, BZablocki, JA Structure-affinity relationships of the affinity of 2-pyrazolyl adenosine analogues for the adenosine A2A receptor. Bioorg Med Chem Lett12:2935-9 (2002) Adenosine receptor A2a
Name:Adenosine receptor A2a
Type:G Protein-Coupled Receptor (GPCR)
Mol. Mass.:45015.65
Organism:Rattus norvegicus (rat)
Description:Rat A2A receptors expressed in CHO cells.
Residue:410
BDBM50119161
NameBDBM50119161
Synonyms:1-[6-Amino-9-((2R,3R,4S,5R)-3,4-dihydroxy-5-hydroxymethyl-tetrahydro-furan-2-yl)-9H-purin-2-yl]-1H-pyrazole-4-carboxylic acid 4-chloro-benzylamide | CHEMBL97937
TypeSmall organic molecule
Emp. Form.C21H21ClN8O5
Mol. Mass.500.895
SMILESNc1nc(nc2n(cnc12)[C@@H]1O[C@H](CO)[C@@H](O)[C@H]1O)-n1cc(cn1)C(=O)NCc1ccc(Cl)cc1