Reaction Details
TargetBeta-1 adrenergic receptor
LigandBDBM50119195
Substrate/Competitorn/a
Meas. Tech.ChEMBL_37244 (CHEMBL651565)
EC50 30±n/a nM
Citation Steffan, RJAshwell, MASolvibile, WRMatelan, ELargis, EHan, STillet, JMulvey, R Novel substituted 4-aminomethylpiperidines as potent and selective human beta3-agonists. Part 2: arylethanolaminomethylpiperidines. Bioorg Med Chem Lett12:2963-7 (2002) Beta-1 adrenergic receptor
Name:Beta-1 adrenergic receptor
Type:G Protein-Coupled Receptor (GPCR)
Mol. Mass.:51338.40
Organism:Homo sapiens (Human)
Description:P08588
Residue:477
BDBM50119195
NameBDBM50119195
Synonyms:CHEMBL317003 | {1-[4-(4-{[(R)-2-Hydroxy-2-(4-hydroxy-3-methanesulfonylamino-phenyl)-ethylamino]-methyl}-piperidine-1-sulfonyl)-phenyl]-1H-indol-3-yl}-acetic acid
TypeSmall organic molecule
Emp. Form.C31H36N4O8S2
Mol. Mass.656.77
SMILESCS(=O)(=O)Nc1cc(ccc1O)[C@@H](O)CNCC1CCN(CC1)S(=O)(=O)c1ccc(cc1)-n1cc(CC(O)=O)c2ccccc12