Reaction Details
TargetBeta-2 adrenergic receptor
LigandBDBM50119202
Substrate/Competitorn/a
Meas. Tech.ChEMBL_38171 (CHEMBL650242)
EC50 30±n/a nM
Citation Steffan, RJAshwell, MASolvibile, WRMatelan, ELargis, EHan, STillet, JMulvey, R Novel substituted 4-aminomethylpiperidines as potent and selective human beta3-agonists. Part 2: arylethanolaminomethylpiperidines. Bioorg Med Chem Lett12:2963-7 (2002) Beta-2 adrenergic receptor
Name:Beta-2 adrenergic receptor
Type:n/a
Mol. Mass.:46461.69
Organism:Homo sapiens (Human)
Description:P07550
Residue:413
BDBM50119202
NameBDBM50119202
Synonyms:CHEMBL99599 | Nonanoic acid [4-(4-{[2-hydroxy-2-(4-hydroxy-3-methanesulfonylamino-phenyl)-ethylamino]-methyl}-piperidine-1-sulfonyl)-phenyl]-amide
TypeSmall organic molecule
Emp. Form.C30H46N4O7S2
Mol. Mass.638.839
SMILESCCCCCCCCC(=O)Nc1ccc(cc1)S(=O)(=O)N1CCC(CNC[C@H](O)c2ccc(O)c(NS(C)(=O)=O)c2)CC1