Reaction Details
TargetCaspase-3
LigandBDBM50119218
Substrate/Competitorn/a
Meas. Tech.ChEMBL_46676 (CHEMBL658634)
IC50 2.3±n/a nM
Citation Linton, SDKaranewsky, DSTernansky, RJChen, NGuo, XJahangiri, KGKalish, VJMeduna, SPRobinson, EDUllman, BRWu, JCPham, BKodandapani, LSmidt, RDiaz, JLFritz, LCvon Krosigk, URoggo, SSchmitz, ATomaselli, KJ Acyl dipeptides as reversible caspase inhibitors. Part 2: further optimization. Bioorg Med Chem Lett12:2973-5 (2002) Caspase-3
Name:Caspase-3
Type:Hydrolase; heterotetramer of two heterodimers
Mol. Mass.:31607.55
Organism:Homo sapiens (Human)
Description:n/a
Residue:277
BDBM50119218
NameBDBM50119218
Synonyms:4-Benzyloxycarbonylamino-4-[1-(2-hydroxy-5-oxo-tetrahydro-furan-3-ylcarbamoyl)-3-methyl-butylcarbamoyl]-butyric acid | CHEMBL100588
TypeSmall organic molecule
Emp. Form.C23H31N3O9
Mol. Mass.493.5069
SMILESCC(C)C[C@H](NC(=O)[C@H](CCC(O)=O)NC(=O)OCc1ccccc1)C(=O)N[C@H]1CC(=O)OC1O