Reaction Details
TargetCaspase-7
LigandBDBM50072047
Substrate/Competitorn/a
Meas. Tech.ChEMBL_46848 (CHEMBL657315)
IC50 10±n/a nM
Citation Linton, SDKaranewsky, DSTernansky, RJChen, NGuo, XJahangiri, KGKalish, VJMeduna, SPRobinson, EDUllman, BRWu, JCPham, BKodandapani, LSmidt, RDiaz, JLFritz, LCvon Krosigk, URoggo, SSchmitz, ATomaselli, KJ Acyl dipeptides as reversible caspase inhibitors. Part 2: further optimization. Bioorg Med Chem Lett12:2973-5 (2002) Caspase-7
Name:Caspase-7
Type:Enzyme
Mol. Mass.:34273.91
Organism:Homo sapiens (Human)
Description:P55210
Residue:303
BDBM50072047
NameBDBM50072047
Synonyms:4-(2-Acetylamino-3-carboxy-propionylamino)-4-[1-((S)-2-hydroxy-5-oxo-tetrahydro-furan-3-ylcarbamoyl)-2-methyl-propylcarbamoyl]-butyric acid | CHEMBL430648
TypeSmall organic molecule
Emp. Form.C20H30N4O11
Mol. Mass.502.4724
SMILESCC(C)[C@H](NC(=O)[C@H](CCC(O)=O)NC(=O)[C@H](CC(O)=O)NC(C)=O)C(=O)N[C@H]1CC(=O)OC1O