Reaction Details
TargetCruzipain
LigandBDBM50108849
Substrate/Competitorn/a
Meas. Tech.ChEMBL_158952 (CHEMBL767337)
Ki 1.1±n/a nM
Citation Huang, LEllman, JA General solid-phase method to prepare novel cyclic ketone inhibitors of the cysteine protease cruzain. Bioorg Med Chem Lett12:2993-6 (2002) Cruzipain
Name:Cruzipain
Type:Protein
Mol. Mass.:49831.41
Organism:Trypanosoma cruzi
Description:P25779
Residue:467
BDBM50108849
NameBDBM50108849
Synonyms:CHEMBL321974 {3-Methyl-1-[2-oxo-1-phenethyl-3-(3-phenyl-propylsulfanyl)-propylcarbamoyl]-butyl}-carbamic acid pyridin-3-ylmethyl ester
TypeSmall organic molecule
Emp. Form.C33H41N3O4S
Mol. Mass.575.761
SMILESCC(C)C[C@H](NC(=O)OCc1cccnc1)C(=O)N[C@@H](CCc1ccccc1)C(=O)CSCCCc1ccccc1