Reaction Details
TargetDihydroorotate dehydrogenase (quinone), mitochondrial
LigandBDBM50119485
Substrate/Competitorn/a
Meas. Tech.ChEMBL_52885 (CHEMBL665409)
Ki 12±n/a nM
Citation Haque, TSTadesse, SMarcinkeviciene, JRogers, MJSizemore, CKopcho, LMAmsler, KEcret, LDZhan, DLHobbs, FSlee, ATrainor, GLStern, AMCopeland, RACombs, AP Parallel synthesis of potent, pyrazole-based inhibitors of Helicobacter pylori dihydroorotate dehydrogenase. J Med Chem45:4669-78 (2002) Dihydroorotate dehydrogenase (quinone), mitochondrial
Name:Dihydroorotate dehydrogenase (quinone), mitochondrial
Type:Enzyme
Mol. Mass.:42881.33
Organism:Homo sapiens (Human)
Description:Q02127
Residue:395
BDBM50119485
NameBDBM50119485
Synonyms:1-(4-Methoxy-phenyl)-1H-pyrazole-3,5-dicarboxylic acid 5-phenylamide 3-[(pyridin-3-ylmethyl)-amide] | CHEMBL143552
TypeSmall organic molecule
Emp. Form.C24H21N5O3
Mol. Mass.427.4552
SMILESCOc1ccc(cc1)-n1nc(cc1C(=O)Nc1ccccc1)C(=O)NCc1cccnc1