Reaction Details
TargetDihydroorotate dehydrogenase (quinone), mitochondrial
LigandBDBM50119492
Substrate/Competitorn/a
Meas. Tech.ChEMBL_52885 (CHEMBL665409)
Ki 32±n/a nM
Citation Haque, TSTadesse, SMarcinkeviciene, JRogers, MJSizemore, CKopcho, LMAmsler, KEcret, LDZhan, DLHobbs, FSlee, ATrainor, GLStern, AMCopeland, RACombs, AP Parallel synthesis of potent, pyrazole-based inhibitors of Helicobacter pylori dihydroorotate dehydrogenase. J Med Chem45:4669-78 (2002) Dihydroorotate dehydrogenase (quinone), mitochondrial
Name:Dihydroorotate dehydrogenase (quinone), mitochondrial
Type:Enzyme
Mol. Mass.:42881.33
Organism:Homo sapiens (Human)
Description:Q02127
Residue:395
BDBM50119492
NameBDBM50119492
Synonyms:1-(4-Chloro-phenyl)-1H-pyrazole-3,5-dicarboxylic acid 3-(4-methyl-benzylamide) 5-phenylamide | CHEMBL143868
TypeSmall organic molecule
Emp. Form.C25H21ClN4O2
Mol. Mass.444.913
SMILESCc1ccc(CNC(=O)c2cc(C(=O)Nc3ccccc3)n(n2)-c2ccc(Cl)cc2)cc1