Reaction Details
TargetEndothelin-1 receptor
LigandBDBM50119662
Substrate/Competitorn/a
Meas. Tech.ChEBML_65490
IC50 0.550000±n/a nM
Citation Niiyama, KTakahashi, HNagase, TKojima, HAmano, YKatsuki, KYamakawa, TOzaki, SIhara, MYano, MFukuroda, TNishikibe, MIshikawa, K Structure-Activity relationships of 2-substituted 5,7-Diarylcyclopenteno[1,2-b]pyridine-6-carboxylic acids as a novel class of endothelin receptor antagonists. Bioorg Med Chem Lett12:3041-5 (2002) Endothelin-1 receptor
Name:Endothelin-1 receptor
Type:Enzyme Catalytic Domain
Mol. Mass.:48736.88
Organism:Homo sapiens (Human)
Description:P25101
Residue:427
BDBM50119662
NameBDBM50119662
Synonyms:(R)-5-Benzo[1,3]dioxol-5-yl-2-(3-hydroxy-propyl)-7-(4-methoxy-phenyl)-6,7-dihydro-5H-[1]pyrindine-6-carboxylic acid | CHEMBL323561
TypeSmall organic molecule
Emp. Form.C26H25NO6
Mol. Mass.447.4798
SMILESCOc1ccc(cc1)[C@H]1[C@@H]([C@H](c2ccc(CCCO)nc12)c1ccc2OCOc2c1)C(O)=O