Reaction Details
TargetEndothelin-1 receptor
LigandBDBM50119678
Substrate/Competitorn/a
Meas. Tech.ChEBML_65490
IC50 0.100000±n/a nM
Citation Niiyama, KTakahashi, HNagase, TKojima, HAmano, YKatsuki, KYamakawa, TOzaki, SIhara, MYano, MFukuroda, TNishikibe, MIshikawa, K Structure-Activity relationships of 2-substituted 5,7-Diarylcyclopenteno[1,2-b]pyridine-6-carboxylic acids as a novel class of endothelin receptor antagonists. Bioorg Med Chem Lett12:3041-5 (2002) Endothelin-1 receptor
Name:Endothelin-1 receptor
Type:Enzyme Catalytic Domain
Mol. Mass.:48736.88
Organism:Homo sapiens (Human)
Description:P25101
Residue:427
BDBM50119678
NameBDBM50119678
Synonyms:(R)-5-Benzo[1,3]dioxol-5-yl-2-isopropylamino-7-(4-methoxy-phenyl)-6,7-dihydro-5H-[1]pyrindine-6-carboxylic acid | CHEMBL448165
TypeSmall organic molecule
Emp. Form.C26H26N2O5
Mol. Mass.446.495
SMILESCOc1ccc(cc1)[C@H]1[C@@H]([C@H](c2ccc(NC(C)C)nc12)c1ccc2OCOc2c1)C(O)=O