Reaction Details
TargetHistamine H3 receptor
LigandBDBM50119696
Substrate/Competitorn/a
Meas. Tech.ChEMBL_86755 (CHEMBL693565)
Ki 676±n/a nM
Citation Vasudevan, AConner, SEGentles, RGFaghih, RLiu, HDwight, WIreland, LKang, CHEsbenshade, TABennani, YLHancock, AA Synthesis and evaluation of potent pyrrolidine H(3) antagonists. Bioorg Med Chem Lett12:3055-8 (2002) Histamine H3 receptor
Name:Histamine H3 receptor
Type:G Protein-Coupled Receptor (GPCR)
Mol. Mass.:48607.98
Organism:Rattus norvegicus (rat)
Description:n/a
Residue:445
BDBM50119696
NameBDBM50119696
Synonyms:1-{4-[3-((S)-3-Amino-pyrrolidin-1-yl)-propoxy]-phenyl}-ethanone | CHEMBL319231
TypeSmall organic molecule
Emp. Form.C15H22N2O2
Mol. Mass.262.3474
SMILESCC(=O)c1ccc(OCCCN2CC[C@H](N)C2)cc1